Reaction Details
TargetBeta-1 adrenergic receptor
LigandBDBM50027163
Substrate/Competitorn/a
Meas. Tech.ChEMBL_310554 (CHEMBL834455)
EC50 3±n/a nM
Citation Nakajima, YHamashima, HWashizuka, KTomishima, YOhtake, HImamura, EMiura, TKayakiri, HKato, M Discovery of a novel, potent and selective human beta3-adrenergic receptor agonist. Bioorg Med Chem Lett15:251-4 (2004) 
 
Beta-1 adrenergic receptor
Name:Beta-1 adrenergic receptor
Type:G Protein-Coupled Receptor (GPCR)
Mol. Mass.:51338.40
Organism:Homo sapiens (Human)
Description:P08588
Residue:477
BDBM50027163
NameBDBM50027163
Synonyms:CHEMBL183211
TypeSmall organic molecule
Emp. Form.C24H27N3O4
Mol. Mass.421.4889
SMILES[H][C@](O)(Cc1ccc(NC(=O)Nc2ccccc2)cc1)NC[C@H](O)COc1ccccc1