Reaction Details
TargetProstaglandin E2 receptor EP3 subtype
LigandBDBM50159772
Substrate/Competitorn/a
Meas. Tech.ChEMBL_302796 (CHEMBL839480)
Ki 65±n/a nM
Citation Belley, MGallant, MRoy, BHoude, KLachance, NLabelle, MTrimble, LAChauret, NLi, CSawyer, NTremblay, NLamontagne, SCarrière, MCDenis, DGreig, GMSlipetz, DMetters, KMGordon, RChan, CCZamboni, RJ Structure-activity relationship studies on ortho-substituted cinnamic acids, a new class of selective EP(3) antagonists. Bioorg Med Chem Lett15:527-30 (2005) 
 
Prostaglandin E2 receptor EP3 subtype
Name:Prostaglandin E2 receptor EP3 subtype
Type:Enzyme
Mol. Mass.:43335.03
Organism:Homo sapiens (Human)
Description:P43115
Residue:390
BDBM50159772
NameBDBM50159772
Synonyms:3-{2-[3-(2-Benzyloxy-3-methyl-phenyl)-propyl]-phenyl}-propionic acid | CHEMBL180343
TypeSmall organic molecule
Emp. Form.C26H28O3
Mol. Mass.388.4987
SMILESCc1cccc(CCCc2ccccc2CCC(O)=O)c1OCc1ccccc1