Reaction Details
TargetProstaglandin E2 receptor EP3 subtype
LigandBDBM50370469
Substrate/Competitorn/a
Meas. Tech.ChEMBL_302796 (CHEMBL839480)
Ki 260±n/a nM
Citation Belley, MGallant, MRoy, BHoude, KLachance, NLabelle, MTrimble, LAChauret, NLi, CSawyer, NTremblay, NLamontagne, SCarrière, MCDenis, DGreig, GMSlipetz, DMetters, KMGordon, RChan, CCZamboni, RJ Structure-activity relationship studies on ortho-substituted cinnamic acids, a new class of selective EP(3) antagonists. Bioorg Med Chem Lett15:527-30 (2005) 
 
Prostaglandin E2 receptor EP3 subtype
Name:Prostaglandin E2 receptor EP3 subtype
Type:Enzyme
Mol. Mass.:43335.03
Organism:Homo sapiens (Human)
Description:P43115
Residue:390
BDBM50370469
NameBDBM50370469
Synonyms:CHEMBL1237303
TypeSmall organic molecule
Emp. Form.C27H24O4
Mol. Mass.412.4771
SMILESCC(=O)c1ccc(OCc2ccccc2)c(C\C=C\c2ccccc2C=CC(O)=O)c1