Reaction Details
TargetProstaglandin E2 receptor EP2 subtype
LigandBDBM50159775
Substrate/Competitorn/a
Meas. Tech.ChEMBL_302795 (CHEMBL839479)
Ki 990±n/a nM
Citation Belley, MGallant, MRoy, BHoude, KLachance, NLabelle, MTrimble, LAChauret, NLi, CSawyer, NTremblay, NLamontagne, SCarrière, MCDenis, DGreig, GMSlipetz, DMetters, KMGordon, RChan, CCZamboni, RJ Structure-activity relationship studies on ortho-substituted cinnamic acids, a new class of selective EP(3) antagonists. Bioorg Med Chem Lett15:527-30 (2005) 
 
Prostaglandin E2 receptor EP2 subtype
Name:Prostaglandin E2 receptor EP2 subtype
Type:Enzyme
Mol. Mass.:39775.71
Organism:Homo sapiens (Human)
Description:P43116
Residue:358
BDBM50159775
NameBDBM50159775
Synonyms:3-{2-[2-(2-Benzyloxy-3-methyl-phenyl)-cyclopropyl]-phenyl}-propionic acid | CHEMBL180752
TypeSmall organic molecule
Emp. Form.C26H26O3
Mol. Mass.386.4828
SMILESCc1cccc(C2CC2c2ccccc2CCC(O)=O)c1OCc1ccccc1