Reaction Details
TargetProstaglandin E2 receptor EP2 subtype
LigandBDBM50370464
Substrate/Competitorn/a
Meas. Tech.ChEMBL_302795 (CHEMBL839479)
Ki 680±n/a nM
Citation Belley, MGallant, MRoy, BHoude, KLachance, NLabelle, MTrimble, LAChauret, NLi, CSawyer, NTremblay, NLamontagne, SCarrière, MCDenis, DGreig, GMSlipetz, DMetters, KMGordon, RChan, CCZamboni, RJ Structure-activity relationship studies on ortho-substituted cinnamic acids, a new class of selective EP(3) antagonists. Bioorg Med Chem Lett15:527-30 (2005) 
 
Prostaglandin E2 receptor EP2 subtype
Name:Prostaglandin E2 receptor EP2 subtype
Type:Enzyme
Mol. Mass.:39775.71
Organism:Homo sapiens (Human)
Description:P43116
Residue:358
BDBM50370464
NameBDBM50370464
Synonyms:CHEMBL1237297
TypeSmall organic molecule
Emp. Form.C25H22O3
Mol. Mass.370.4404
SMILESOC(=O)\C=C\c1ccccc1\C=C\Cc1ccccc1OCc1ccccc1