Reaction Details
TargetProstaglandin E2 receptor EP3 subtype
LigandBDBM50134524
Substrate/Competitorn/a
Meas. Tech.ChEMBL_302796 (CHEMBL839480)
Ki 7±n/a nM
Citation Belley, MGallant, MRoy, BHoude, KLachance, NLabelle, MTrimble, LAChauret, NLi, CSawyer, NTremblay, NLamontagne, SCarrière, MCDenis, DGreig, GMSlipetz, DMetters, KMGordon, RChan, CCZamboni, RJ Structure-activity relationship studies on ortho-substituted cinnamic acids, a new class of selective EP(3) antagonists. Bioorg Med Chem Lett15:527-30 (2005) 
 
Prostaglandin E2 receptor EP3 subtype
Name:Prostaglandin E2 receptor EP3 subtype
Type:Enzyme
Mol. Mass.:43335.03
Organism:Homo sapiens (Human)
Description:P43115
Residue:390
BDBM50134524
NameBDBM50134524
Synonyms:(E)-3-{2-[(E)-3-(2-Benzyloxy-3-methyl-phenyl)-allyl]-phenyl}-acrylic acid | CHEMBL123794
TypeSmall organic molecule
Emp. Form.C26H24O3
Mol. Mass.384.467
SMILESCc1cccc(\C=C\Cc2ccccc2\C=C\C(O)=O)c1OCc1ccccc1