Reaction Details
TargetProstaglandin E2 receptor EP2 subtype
LigandBDBM50159778
Substrate/Competitorn/a
Meas. Tech.ChEMBL_302795 (CHEMBL839479)
Ki 5400±n/a nM
Citation Belley, MGallant, MRoy, BHoude, KLachance, NLabelle, MTrimble, LAChauret, NLi, CSawyer, NTremblay, NLamontagne, SCarrière, MCDenis, DGreig, GMSlipetz, DMetters, KMGordon, RChan, CCZamboni, RJ Structure-activity relationship studies on ortho-substituted cinnamic acids, a new class of selective EP(3) antagonists. Bioorg Med Chem Lett15:527-30 (2005) 
 
Prostaglandin E2 receptor EP2 subtype
Name:Prostaglandin E2 receptor EP2 subtype
Type:Enzyme
Mol. Mass.:39775.71
Organism:Homo sapiens (Human)
Description:P43116
Residue:358
BDBM50159778
NameBDBM50159778
Synonyms:(E)-3-(2-{(E)-3-[2-(2,6-Dichloro-benzyloxy)-3-methyl-phenyl]-allyl}-phenyl)-acrylic acid | CHEMBL183919
TypeSmall organic molecule
Emp. Form.C26H22Cl2O3
Mol. Mass.453.357
SMILESCc1cccc(\C=C\Cc2ccccc2\C=C\C(O)=O)c1OCc1c(Cl)cccc1Cl