Reaction Details
TargetCarbonic anhydrase 1
LigandBDBM50159790
Substrate/Competitorn/a
Meas. Tech.ChEMBL_302504 (CHEMBL828220)
Ki 95000000±n/a nM
Citation Innocenti, AVullo, DScozzafava, ASupuran, CT Carbonic anhydrase inhibitors. Inhibition of isozymes I, II, IV, V, and IX with anions isosteric and isoelectronic with sulfate, nitrate, and carbonate. Bioorg Med Chem Lett15:567-71 (2005) 
 
Carbonic anhydrase 1
Name:Carbonic anhydrase 1
Type:Enzyme
Mol. Mass.:28873.37
Organism:Homo sapiens (Human)
Description:P00915
Residue:261
BDBM50159790
NameBDBM50159790
Synonyms:IO3(-) iodate | iodatetrioxidoiodate(1-)
TypeSmall organic molecule
Emp. Form.IO3
Mol. Mass.174.9032
SMILES[O-][I](=O)=O