Reaction Details
TargetCarbonic anhydrase 4
LigandBDBM36131
Substrate/Competitorn/a
Meas. Tech.ChEMBL_302535 (CHEMBL827387)
Ki 767000000±n/a nM
Citation Innocenti, AVullo, DScozzafava, ASupuran, CT Carbonic anhydrase inhibitors. Inhibition of isozymes I, II, IV, V, and IX with anions isosteric and isoelectronic with sulfate, nitrate, and carbonate. Bioorg Med Chem Lett15:567-71 (2005) 
 
Carbonic anhydrase 4
Name:Carbonic anhydrase 4
Type:Enzyme
Mol. Mass.:35037.98
Organism:Homo sapiens (Human)
Description:P22748
Residue:312
BDBM36131
NameBDBM36131
Synonyms:perchlorate | sodium perchlorate
TypeGuest
Emp. Form.ClO4
Mol. Mass.99.451
SMILES[O-][Cl](=O)(=O)=O