Reaction Details
TargetCarbonic anhydrase 2
LigandBDBM26994
Substrate/Competitorn/a
Meas. Tech.ChEMBL_302534 (CHEMBL827386)
Ki 390000±n/a nM
Citation Innocenti, AVullo, DScozzafava, ASupuran, CT Carbonic anhydrase inhibitors. Inhibition of isozymes I, II, IV, V, and IX with anions isosteric and isoelectronic with sulfate, nitrate, and carbonate. Bioorg Med Chem Lett15:567-71 (2005) 
 
Carbonic anhydrase 2
Name:Carbonic anhydrase 2
Type:Enzyme
Mol. Mass.:29250.71
Organism:Homo sapiens (Human)
Description:P00918
Residue:260
BDBM26994
NameBDBM26994
Synonyms:CHEMBL68253 sulfamic acid
Typen/a
Emp. Form.H3NO3S
Mol. Mass.97.094
SMILESNS(O)(=O)=O