Reaction Details
TargetCarbonic anhydrase 5A, mitochondrial
LigandBDBM26995
Substrate/Competitorn/a
Meas. Tech.ChEMBL_302505 (CHEMBL828221)
Ki 840000±n/a nM
Citation Innocenti, AVullo, DScozzafava, ASupuran, CT Carbonic anhydrase inhibitors. Inhibition of isozymes I, II, IV, V, and IX with anions isosteric and isoelectronic with sulfate, nitrate, and carbonate. Bioorg Med Chem Lett15:567-71 (2005) 
 
Carbonic anhydrase 5A, mitochondrial
Name:Carbonic anhydrase 5A, mitochondrial
Type:Enzyme
Mol. Mass.:34755.54
Organism:Homo sapiens (Human)
Description:Human (cloned) isozyme
Residue:305
BDBM26995
NameBDBM26995
Synonyms:CHEMBL355001 sulfamamide sulfamoylamine
Typen/a
Emp. Form.H4N2O2S
Mol. Mass.96.109
SMILESNS(N)(=O)=O