Reaction Details
TargetCarbonic anhydrase 5A, mitochondrial
LigandBDBM50152970
Substrate/Competitorn/a
Meas. Tech.ChEMBL_302505 (CHEMBL828221)
Ki 16000000±n/a nM
Citation Innocenti, AVullo, DScozzafava, ASupuran, CT Carbonic anhydrase inhibitors. Inhibition of isozymes I, II, IV, V, and IX with anions isosteric and isoelectronic with sulfate, nitrate, and carbonate. Bioorg Med Chem Lett15:567-71 (2005) 
 
Carbonic anhydrase 5A, mitochondrial
Name:Carbonic anhydrase 5A, mitochondrial
Type:Enzyme
Mol. Mass.:34755.54
Organism:Homo sapiens (Human)
Description:Human (cloned) isozyme
Residue:305
BDBM50152970
NameBDBM50152970
Synonyms:CHEMBL1352 nitric acid
TypeSmall organic molecule
Emp. Form.HNO3
Mol. Mass.63.0128
SMILESO[N+]([O-])=O