Reaction Details
TargetCarbonic anhydrase 9
LigandBDBM50159791
Substrate/Competitorn/a
Meas. Tech.ChEMBL_302536 (CHEMBL827388)
Ki 147000000±n/a nM
Citation Innocenti, AVullo, DScozzafava, ASupuran, CT Carbonic anhydrase inhibitors. Inhibition of isozymes I, II, IV, V, and IX with anions isosteric and isoelectronic with sulfate, nitrate, and carbonate. Bioorg Med Chem Lett15:567-71 (2005) 
 
Carbonic anhydrase 9
Name:Carbonic anhydrase 9
Type:Enzyme
Mol. Mass.:49669.03
Organism:Homo sapiens (Human)
Description:Catalytic domain of human cloned isozyme was used in the assay
Residue:459
BDBM50159791
NameBDBM50159791
Synonyms:chlorate
TypeSmall organic molecule
Emp. Form.ClO3
Mol. Mass.83.452
SMILES[O-][Cl](=O)=O