Reaction Details
TargetCarbonic anhydrase 4
LigandBDBM50094936
Substrate/Competitorn/a
Meas. Tech.ChEMBL_302535 (CHEMBL827387)
Ki 44800000±n/a nM
Citation Innocenti, AVullo, DScozzafava, ASupuran, CT Carbonic anhydrase inhibitors. Inhibition of isozymes I, II, IV, V, and IX with anions isosteric and isoelectronic with sulfate, nitrate, and carbonate. Bioorg Med Chem Lett15:567-71 (2005) 
 
Carbonic anhydrase 4
Name:Carbonic anhydrase 4
Type:Enzyme
Mol. Mass.:35037.98
Organism:Homo sapiens (Human)
Description:P22748
Residue:312
BDBM50094936
NameBDBM50094936
Synonyms:CHEMBL86473 | Vanadate
TypeSmall organic molecule
Emp. Form.HO3V
Mol. Mass.99.9476
SMILESO[V](=O)=O