Reaction Details
TargetCarbonic anhydrase 2
LigandBDBM33281
Substrate/Competitorn/a
Meas. Tech.ChEMBL_302729 (CHEMBL838677)
Ki 14.6±n/a nM
Citation Winum, JYPastorekova, SJakubickova, LMontero, JLScozzafava, APastorek, JVullo, DInnocenti, ASupuran, CT Carbonic anhydrase inhibitors: synthesis and inhibition of cytosolic/tumor-associated carbonic anhydrase isozymes I, II, and IX with bis-sulfamates. Bioorg Med Chem Lett15:579-84 (2005) 
 
Carbonic anhydrase 2
Name:Carbonic anhydrase 2
Type:Enzyme
Mol. Mass.:29250.71
Organism:Homo sapiens (Human)
Description:P00918
Residue:260
BDBM33281
NameBDBM33281
Synonyms:CHEMBL182455 | bis-sulfamate, 3
TypeSmall organic molecule
Emp. Form.C8H20N2O6S2
Mol. Mass.304.384
SMILESNS(=O)(=O)OCCCCCCCCOS(N)(=O)=O