Reaction Details
Target3-hydroxy-3-methylglutaryl-coenzyme A reductase
LigandBDBM50160771
Substrate/Competitorn/a
Meas. Tech.ChEMBL_305887 (CHEMBL832902)
IC50 8.30±n/a nM
Citation Thilagavathi, RKumar, RAparna, VSobhia, MEGopalakrishnan, BChakraborti, AK Three-dimensional quantitative structure (3-D QSAR) activity relationship studies on imidazolyl and N-pyrrolyl heptenoates as 3-hydroxy-3-methylglutaryl-CoA reductase (HMGR) inhibitors by comparative molecular similarity indices analysis (CoMSIA). Bioorg Med Chem Lett15:1027-32 (2005) 
 
3-hydroxy-3-methylglutaryl-coenzyme A reductase
Name:3-hydroxy-3-methylglutaryl-coenzyme A reductase
Type:Enzyme
Mol. Mass.:97477.10
Organism:Homo sapiens (Human)
Description:P04035
Residue:888
BDBM50160771
NameBDBM50160771
Synonyms:(E)-(3R,5S)-7-[2-(4-Fluoro-phenyl)-5-isopropyl-3-pyridin-4-yl-pyrrol-1-yl]-3,5-dihydroxy-hept-6-enoic acid anion
TypeSmall organic molecule
Emp. Form.C25H26FN2O4
Mol. Mass.437.4839
SMILESCC(C)c1cc(c(-c2ccc(F)cc2)n1\C=C\[C@@H](O)C[C@@H](O)CC([O-])=O)-c1ccncc1