Reaction Details
Target3-hydroxy-3-methylglutaryl-coenzyme A reductase
LigandBDBM50042638
Substrate/Competitorn/a
Meas. Tech.ChEMBL_305887 (CHEMBL832902)
IC50 7.25±n/a nM
Citation Thilagavathi, RKumar, RAparna, VSobhia, MEGopalakrishnan, BChakraborti, AK Three-dimensional quantitative structure (3-D QSAR) activity relationship studies on imidazolyl and N-pyrrolyl heptenoates as 3-hydroxy-3-methylglutaryl-CoA reductase (HMGR) inhibitors by comparative molecular similarity indices analysis (CoMSIA). Bioorg Med Chem Lett15:1027-32 (2005) 
 
3-hydroxy-3-methylglutaryl-coenzyme A reductase
Name:3-hydroxy-3-methylglutaryl-coenzyme A reductase
Type:Enzyme
Mol. Mass.:97477.10
Organism:Homo sapiens (Human)
Description:P04035
Residue:888
BDBM50042638
NameBDBM50042638
Synonyms:(E)-(3R,5S)-7-[5-(3,5-Dimethyl-phenyl)-4-(4-fluoro-phenyl)-2-isopropyl-imidazol-1-yl]-3,5-dihydroxy-hept-6-enoic acid anion Sodium; 7-[5-(3,5-dimethyl-phenyl)-4-(4-fluoro-phenyl)-2-isopropyl-imidazol-1-yl]-3,5-dihydroxy-hept-6-enoate
TypeSmall organic molecule
Emp. Form.C27H30FN2O4
Mol. Mass.465.5371
SMILESCC(C)c1nc(c(-c2cc(C)cc(C)c2)n1\C=C\[C@@H](O)C[C@@H](O)CC([O-])=O)-c1ccc(F)cc1