Reaction Details
Target3-hydroxy-3-methylglutaryl-coenzyme A reductase
LigandBDBM18372
Substrate/Competitorn/a
Meas. Tech.ChEMBL_305887 (CHEMBL832902)
IC50 5±n/a nM
Citation Thilagavathi, RKumar, RAparna, VSobhia, MEGopalakrishnan, BChakraborti, AK Three-dimensional quantitative structure (3-D QSAR) activity relationship studies on imidazolyl and N-pyrrolyl heptenoates as 3-hydroxy-3-methylglutaryl-CoA reductase (HMGR) inhibitors by comparative molecular similarity indices analysis (CoMSIA). Bioorg Med Chem Lett15:1027-32 (2005) 
 
3-hydroxy-3-methylglutaryl-coenzyme A reductase
Name:3-hydroxy-3-methylglutaryl-coenzyme A reductase
Type:Enzyme
Mol. Mass.:97477.10
Organism:Homo sapiens (Human)
Description:P04035
Residue:888
BDBM18372
NameBDBM18372
Synonyms:(3R,5S,6E)-7-[4-(4-fluorophenyl)-2-(N-methylmethanesulfonamido)-6-(propan-2-yl)pyrimidin-5-yl]-3,5-dihydroxyhept-6-enoic acid Ros US9102656, Rosuvastatin | ZD4522
TypeSmall organic molecule
Emp. Form.C22H28FN3O6S
Mol. Mass.481.538
SMILESCC(C)c1nc(nc(-c2ccc(F)cc2)c1\C=C\[C@@H](O)C[C@@H](O)CC(O)=O)N(C)S(C)(=O)=O