Reaction Details
Target3-hydroxy-3-methylglutaryl-coenzyme A reductase
LigandBDBM50160769
Substrate/Competitorn/a
Meas. Tech.ChEMBL_305887 (CHEMBL832902)
IC50 8.70±n/a nM
Citation Thilagavathi, RKumar, RAparna, VSobhia, MEGopalakrishnan, BChakraborti, AK Three-dimensional quantitative structure (3-D QSAR) activity relationship studies on imidazolyl and N-pyrrolyl heptenoates as 3-hydroxy-3-methylglutaryl-CoA reductase (HMGR) inhibitors by comparative molecular similarity indices analysis (CoMSIA). Bioorg Med Chem Lett15:1027-32 (2005) 
 
3-hydroxy-3-methylglutaryl-coenzyme A reductase
Name:3-hydroxy-3-methylglutaryl-coenzyme A reductase
Type:Enzyme
Mol. Mass.:97477.10
Organism:Homo sapiens (Human)
Description:P04035
Residue:888
BDBM50160769
NameBDBM50160769
Synonyms:(E)-(3R,5S)-7-[2,3-Bis-(4-fluoro-phenyl)-5-isopropyl-pyrrol-1-yl]-3,5-dihydroxy-hept-6-enoic acid anion
TypeSmall organic molecule
Emp. Form.C26H26F2NO4
Mol. Mass.454.4863
SMILESCC(C)c1cc(c(-c2ccc(F)cc2)n1\C=C\[C@@H](O)C[C@@H](O)CC([O-])=O)-c1ccc(F)cc1