Reaction Details
TargetSodium-dependent dopamine transporter
LigandBDBM50160895
Substrate/Competitorn/a
Meas. Tech.ChEMBL_303179 (CHEMBL829673)
Ki 6.430±n/a nM
Citation Tamagnan, GAlagille, DFu, XKula, NSBaldessarini, RJInnis, RBBaldwin, RM Synthesis and monoamine transporter affinity of new 2beta-carbomethoxy-3beta-[4-(substituted thiophenyl)]phenyltropanes: discovery of a selective SERT antagonist with picomolar potency. Bioorg Med Chem Lett15:1131-3 (2005) 
 
Sodium-dependent dopamine transporter
Name:Sodium-dependent dopamine transporter
Type:Multi-pass membrane protein
Mol. Mass.:68749.45
Organism:Rattus norvegicus (rat)
Description:P23977
Residue:619
BDBM50160895
NameBDBM50160895
Synonyms:3-[4-(5-Bromo-thiophen-2-yl)-phenyl]-8-methyl-8-aza-bicyclo[3.2.1]octane-2-carboxylic acid methyl ester | CHEMBL180918
TypeSmall organic molecule
Emp. Form.C20H22BrNO2S
Mol. Mass.420.363
SMILESCOC(=O)C1C2CCC(CC1c1ccc(cc1)-c1ccc(Br)s1)N2C