Reaction Details
TargetCarbonic anhydrase 1
LigandBDBM10882
Substrate/Competitorn/a
Meas. Tech.ChEMBL_302630 (CHEMBL876689)
Ki 25±n/a nM
Citation Innocenti, AFirnges, MAAntel, JWurl, MScozzafava, ASupuran, CT Carbonic anhydrase inhibitors. Inhibition of the membrane-bound human and bovine isozymes IV with sulfonamides. Bioorg Med Chem Lett15:1149-54 (2005) 
 
Carbonic anhydrase 1
Name:Carbonic anhydrase 1
Type:Enzyme
Mol. Mass.:28873.37
Organism:Homo sapiens (Human)
Description:P00915
Residue:261
BDBM10882
NameBDBM10882
Synonyms:6-ethoxy-1,3-benzothiazole-2-sulfonamide Ethamide Ethoxzolamide Ethoxzolamide, EZM US10172837, Ethoxyzolamide | sulfonamide 3
TypeSmall organic molecule
Emp. Form.C9H10N2O3S2
Mol. Mass.258.317
SMILESCCOc1ccc2nc(sc2c1)S(N)(=O)=O