Reaction Details
TargetCarbonic anhydrase 4
LigandBDBM10864
Substrate/Competitorn/a
Meas. Tech.ChEMBL_302669 (CHEMBL839013)
Ki 96±n/a nM
Citation Innocenti, AFirnges, MAAntel, JWurl, MScozzafava, ASupuran, CT Carbonic anhydrase inhibitors. Inhibition of the membrane-bound human and bovine isozymes IV with sulfonamides. Bioorg Med Chem Lett15:1149-54 (2005) 
 
Carbonic anhydrase 4
Name:Carbonic anhydrase 4
Type:Enzyme
Mol. Mass.:35037.98
Organism:Homo sapiens (Human)
Description:P22748
Residue:312
BDBM10864
NameBDBM10864
Synonyms:4-Amino-3-bromobenzenesulfonamide CHEMBL6724 halogenosulfanilamide deriv. 5d
TypeSmall organic molecule
Emp. Form.C6H7BrN2O2S
Mol. Mass.251.101
SMILESNc1ccc(cc1Br)S(N)(=O)=O