Reaction Details
TargetCarbonic anhydrase 1
LigandBDBM10866
Substrate/Competitorn/a
Meas. Tech.ChEMBL_302630 (CHEMBL876689)
Ki 5800±n/a nM
Citation Innocenti, AFirnges, MAAntel, JWurl, MScozzafava, ASupuran, CT Carbonic anhydrase inhibitors. Inhibition of the membrane-bound human and bovine isozymes IV with sulfonamides. Bioorg Med Chem Lett15:1149-54 (2005) 
 
Carbonic anhydrase 1
Name:Carbonic anhydrase 1
Type:Enzyme
Mol. Mass.:28873.37
Organism:Homo sapiens (Human)
Description:P00915
Residue:261
BDBM10866
NameBDBM10866
Synonyms:4-amino-6-(trifluoromethyl)benzene-1,3-disulfonamide aromatic/heteroaromatic sulfonamide 11
TypeSmall organic molecule
Emp. Form.C7H8F3N3O4S2
Mol. Mass.319.281
SMILESNc1cc(c(cc1S(N)(=O)=O)S(N)(=O)=O)C(F)(F)F