Reaction Details
TargetCarbonic anhydrase 12
LigandBDBM10855
Substrate/Competitorn/a
Meas. Tech.ChEMBL_302410 (CHEMBL828815)
Ki 0.850±n/a nM
Citation Vullo, DInnocenti, ANishimori, IPastorek, JScozzafava, APastoreková, SSupuran, CT Carbonic anhydrase inhibitors. Inhibition of the transmembrane isozyme XII with sulfonamides-a new target for the design of antitumor and antiglaucoma drugs? Bioorg Med Chem Lett15:963-9 (2005) 
 
Carbonic anhydrase 12
Name:Carbonic anhydrase 12
Type:Enzyme
Mol. Mass.:39456.00
Organism:Homo sapiens (Human)
Description:Catalytic domain of human cloned isozyme was used in the assay
Residue:354
BDBM10855
NameBDBM10855
Synonyms:2-aminobenzene-1-sulfonamide US10172837, 2-aminobenzenesulfonamide orthanilamide 17
TypeSmall organic molecule
Emp. Form.C6H8N2O2S
Mol. Mass.172.205
SMILESNc1ccccc1S(N)(=O)=O