Reaction Details
TargetCarbonic anhydrase 1
LigandBDBM10859
Substrate/Competitorn/a
Meas. Tech.ChEMBL_302370 (CHEMBL830339)
Ki 78500±n/a nM
Citation Vullo, DInnocenti, ANishimori, IPastorek, JScozzafava, APastoreková, SSupuran, CT Carbonic anhydrase inhibitors. Inhibition of the transmembrane isozyme XII with sulfonamides-a new target for the design of antitumor and antiglaucoma drugs? Bioorg Med Chem Lett15:963-9 (2005) 
 
Carbonic anhydrase 1
Name:Carbonic anhydrase 1
Type:Enzyme
Mol. Mass.:28873.37
Organism:Homo sapiens (Human)
Description:P00915
Residue:261
BDBM10859
NameBDBM10859
Synonyms:4-methylbenzene-1-sulfonamide aromatic/heteroaromatic sulfonamide 4 | hCA inhibitor, 7
TypeSmall organic molecule
Emp. Form.C7H9NO2S
Mol. Mass.171.217
SMILESCc1ccc(cc1)S(N)(=O)=O