Reaction Details
TargetCarbonic anhydrase 2
LigandBDBM10874
Substrate/Competitorn/a
Meas. Tech.ChEMBL_302394 (CHEMBL829640)
Ki 30±n/a nM
Citation Vullo, DInnocenti, ANishimori, IPastorek, JScozzafava, APastoreková, SSupuran, CT Carbonic anhydrase inhibitors. Inhibition of the transmembrane isozyme XII with sulfonamides-a new target for the design of antitumor and antiglaucoma drugs? Bioorg Med Chem Lett15:963-9 (2005) 
 
Carbonic anhydrase 2
Name:Carbonic anhydrase 2
Type:Enzyme
Mol. Mass.:29250.71
Organism:Homo sapiens (Human)
Description:P00918
Residue:260
BDBM10874
NameBDBM10874
Synonyms:6-hydroxy-1,3-benzothiazole-2-sulfonamide aromatic/heteroaromatic sulfonamide 19
TypeSmall organic molecule
Emp. Form.C7H6N2O3S2
Mol. Mass.230.264
SMILESNS(=O)(=O)c1nc2ccc(O)cc2s1