Reaction Details
TargetCarbonic anhydrase 1
LigandBDBM50160671
Substrate/Competitorn/a
Meas. Tech.ChEMBL_302341 (CHEMBL828925)
Ki 95±n/a nM
Citation Vullo, DVoipio, JInnocenti, ARivera, CRanki, HScozzafava, AKaila, KSupuran, CT Carbonic anhydrase inhibitors. Inhibition of the human cytosolic isozyme VII with aromatic and heterocyclic sulfonamides. Bioorg Med Chem Lett15:971-6 (2005) 
 
Carbonic anhydrase 1
Name:Carbonic anhydrase 1
Type:Enzyme
Mol. Mass.:28873.37
Organism:Homo sapiens (Human)
Description:P00915
Residue:261
BDBM50160671
NameBDBM50160671
Synonyms:Benzothiazole-2-sulfonic acid amide | CHEMBL168552
TypeSmall organic molecule
Emp. Form.C7H6N2O2S2
Mol. Mass.214.265
SMILESNS(=O)(=O)c1nc2ccccc2s1