Reaction Details
TargetCarbonic anhydrase 7
LigandBDBM50160673
Substrate/Competitorn/a
Meas. Tech.ChEMBL_302350 (CHEMBL828071)
Ki 7±n/a nM
Citation Vullo, DVoipio, JInnocenti, ARivera, CRanki, HScozzafava, AKaila, KSupuran, CT Carbonic anhydrase inhibitors. Inhibition of the human cytosolic isozyme VII with aromatic and heterocyclic sulfonamides. Bioorg Med Chem Lett15:971-6 (2005) 
 
Carbonic anhydrase 7
Name:Carbonic anhydrase 7
Type:Enzyme
Mol. Mass.:29664.11
Organism:Homo sapiens (Human)
Description:Human cloned isozyme.
Residue:264
BDBM50160673
NameBDBM50160673
Synonyms:5-(4-Amino-benzenesulfonylamino)-4,5-dihydro-[1,3,4]thiadiazole-2-sulfonic acid amide | CHEMBL427312
TypeSmall organic molecule
Emp. Form.C8H11N5O4S3
Mol. Mass.337.399
SMILESNc1ccc(cc1)S(=O)(=O)NC1=NNC(S1)S(N)(=O)=O