Reaction Details
TargetCarbonic anhydrase 1
LigandBDBM10881
Substrate/Competitorn/a
Meas. Tech.ChEMBL_302341 (CHEMBL828925)
Ki 50±n/a nM
Citation Vullo, DVoipio, JInnocenti, ARivera, CRanki, HScozzafava, AKaila, KSupuran, CT Carbonic anhydrase inhibitors. Inhibition of the human cytosolic isozyme VII with aromatic and heterocyclic sulfonamides. Bioorg Med Chem Lett15:971-6 (2005) 
 
Carbonic anhydrase 1
Name:Carbonic anhydrase 1
Type:Enzyme
Mol. Mass.:28873.37
Organism:Homo sapiens (Human)
Description:P00915
Residue:261
BDBM10881
NameBDBM10881
Synonyms:CHEMBL288100 Methazolamide Methazolamide, MZA Sulfonamide, 2 sulfonamide 2
TypeSmall organic molecule
Emp. Form.C5H8N4O3S2
Mol. Mass.236.272
SMILESCC(=O)N=c1sc(nn1C)S(N)(=O)=O