Reaction Details
TargetCarbonic anhydrase 7
LigandBDBM10863
Substrate/Competitorn/a
Meas. Tech.ChEMBL_302350 (CHEMBL828071)
Ki 120±n/a nM
Citation Vullo, DVoipio, JInnocenti, ARivera, CRanki, HScozzafava, AKaila, KSupuran, CT Carbonic anhydrase inhibitors. Inhibition of the human cytosolic isozyme VII with aromatic and heterocyclic sulfonamides. Bioorg Med Chem Lett15:971-6 (2005) 
 
Carbonic anhydrase 7
Name:Carbonic anhydrase 7
Type:Enzyme
Mol. Mass.:29664.11
Organism:Homo sapiens (Human)
Description:Human cloned isozyme.
Residue:264
BDBM10863
NameBDBM10863
Synonyms:4-Amino-3-chlorobenzenesulfonamide CHEMBL7092 halogenosulfanilamide deriv. 5c
TypeSmall organic molecule
Emp. Form.C6H7ClN2O2S
Mol. Mass.206.65
SMILESNc1ccc(cc1Cl)S(N)(=O)=O