Reaction Details
Target72 kDa type IV collagenase
LigandBDBM50161330
Substrate/Competitorn/a
Meas. Tech.ChEMBL_305733 (CHEMBL829405)
IC50 0.09±n/a nM
Citation Rossello, ANuti, ECarelli, POrlandini, EMacchia, MNencetti, SZandomeneghi, MBalzano, FUccello Barretta, GAlbini, ABenelli, RCercignani, GMurphy, GBalsamo, A N-i-Propoxy-N-biphenylsulfonylaminobutylhydroxamic acids as potent and selective inhibitors of MMP-2 and MT1-MMP. Bioorg Med Chem Lett15:1321-6 (2005) 
 
72 kDa type IV collagenase
Name:72 kDa type IV collagenase
Type:Enzyme
Mol. Mass.:73870.36
Organism:Homo sapiens (Human)
Description: P08253
Residue:660
BDBM50161330
NameBDBM50161330
Synonyms:(R)-2-[(Biphenyl-4-sulfonyl)-isopropoxy-amino]-N-hydroxy-3-methyl-butyramide CHEMBL179288
TypeSmall organic molecule
Emp. Form.C20H26N2O5S
Mol. Mass.406.496
SMILESCC(C)ON([C@H](C(C)C)C(=O)NO)S(=O)(=O)c1ccc(cc1)-c1ccccc1