Reaction Details
Target72 kDa type IV collagenase
LigandBDBM50082556
Substrate/Competitorn/a
Meas. Tech.ChEMBL_305733 (CHEMBL829405)
IC50 0.09±n/a nM
Citation Rossello, ANuti, ECarelli, POrlandini, EMacchia, MNencetti, SZandomeneghi, MBalzano, FUccello Barretta, GAlbini, ABenelli, RCercignani, GMurphy, GBalsamo, A N-i-Propoxy-N-biphenylsulfonylaminobutylhydroxamic acids as potent and selective inhibitors of MMP-2 and MT1-MMP. Bioorg Med Chem Lett15:1321-6 (2005) 
 
72 kDa type IV collagenase
Name:72 kDa type IV collagenase
Type:Enzyme
Mol. Mass.:73870.36
Organism:Homo sapiens (Human)
Description: P08253
Residue:660
BDBM50082556
NameBDBM50082556
Synonyms:(S)-2,2-Dimethyl-4-[4-(pyridin-4-yloxy)-benzenesulfonyl]-thiomorpholine-3-carboxylic acid hydroxyamide 2,2-Dimethyl-4-[4-(pyridin-4-yloxy)-benzenesulfonyl]-thiomorpholine-3-carboxylic acid hydroxyamide 2,2-Dimethyl-4-[4-(pyridin-4-yloxy)-benzenesulfonyl]-thiomorpholine-3-carboxylic acid hydroxyamide(prinomastat) CHEMBL75094 | Prinomastat
TypeSmall organic molecule
Emp. Form.C18H21N3O5S2
Mol. Mass.423.506
SMILESCC1(C)SCCN([C@H]1C(=O)NO)S(=O)(=O)c1ccc(Oc2ccncc2)cc1