Reaction Details
TargetCysteine proteinase B
LigandBDBM50134127
Substrate/Competitorn/a
Meas. Tech.ChEMBL_303092 (CHEMBL828764)
Ki 50±n/a nM
Citation Wang, YBenn, AFlinn, NMonk, TRamjee, MWatts, JQuibell, M cis-6-oxo-hexahydro-2-oxa-1,4-diazapentalene and cis-6-oxo-hexahydropyrrolo[3,2-c]pyrazole based scaffolds: design rationale, synthesis and cysteinyl proteinase inhibition. Bioorg Med Chem Lett15:1327-31 (2005) 
 
Cysteine proteinase B
Name:Cysteine proteinase B
Type:PROTEIN
Mol. Mass.:47725.09
Organism:Leishmania mexicana
Description:ChEMBL_303092
Residue:443
BDBM50134127
NameBDBM50134127
Synonyms:CHEMBL607122
TypeSmall organic molecule
Emp. Form.C29H36N4O4
Mol. Mass.504.6205
SMILESCC(C)C[C@H](NC(=O)c1ccc(cc1)C(C)(C)C)C(=O)N1NC[C@@H]2[C@H]1C(=O)CN2C(=O)c1ccccc1