Reaction Details
TargetMu-type opioid receptor
LigandBDBM50162626
Substrate/Competitorn/a
Meas. Tech.ChEBML_302594
Ki 8.7±n/a nM
Citation MacDougall, JMZhang, XDPolgar, WEKhroyan, TVToll, LCashman, JR Synthesis and in vitro biological evaluation of a carbon glycoside analogue of morphine-6-glucuronide. Bioorg Med Chem Lett15:1583-6 (2005) 
 
Mu-type opioid receptor
Name:Mu-type opioid receptor
Type:G Protein-Coupled Receptor (GPCR)
Mol. Mass.:44789.51
Organism:Homo sapiens (Human)
Description:P35372
Residue:400
BDBM50162626
NameBDBM50162626
Synonyms:CHEMBL359534 | M6G thiosaccharide analogue
TypeSmall organic molecule
Emp. Form.C24H31NO8S
Mol. Mass.493.57
SMILESCOC1[C@H](SC2OC(C(O)C(O)C2O)C(O)=O)C=C[C@H]2[C@H]3Cc4ccc(O)cc4[C@@]12CCN3C