Reaction Details
Target5-hydroxytryptamine receptor 6
LigandBDBM50162877
Substrate/Competitorn/a
Meas. Tech.ChEMBL_302832 (CHEMBL838622)
Ki 0.90±n/a nM
Citation Lee, MRangisetty, JBPullagurla, MRDukat, MSetola, VRoth, BLGlennon, RA 1-(1-Naphthyl)piperazine as a novel template for 5-HT6 serotonin receptor ligands. Bioorg Med Chem Lett15:1707-11 (2005) 
 
5-hydroxytryptamine receptor 6
Name:5-hydroxytryptamine receptor 6
Type:G Protein-Coupled Receptor (GPCR)
Mol. Mass.:46968.43
Organism:Homo sapiens (Human)
Description:P50406
Residue:440
BDBM50162877
NameBDBM50162877
Synonyms:4-(4-Piperazin-1-yl-naphthalene-1-sulfonyl)-phenylamine; hydrochloride | CHEMBL534472
TypeSmall organic molecule
Emp. Form.C20H21N3O2S
Mol. Mass.367.465
SMILESNc1ccc(cc1)S(=O)(=O)c1ccc(N2CCNCC2)c2ccccc12