Reaction Details
Target5-hydroxytryptamine receptor 6
LigandBDBM50007407
Substrate/Competitorn/a
Meas. Tech.ChEMBL_302792 (CHEMBL839476)
Ki 100±n/a nM
Citation Lee, MRangisetty, JBPullagurla, MRDukat, MSetola, VRoth, BLGlennon, RA 1-(1-Naphthyl)piperazine as a novel template for 5-HT6 serotonin receptor ligands. Bioorg Med Chem Lett15:1707-11 (2005) 
 
5-hydroxytryptamine receptor 6
Name:5-hydroxytryptamine receptor 6
Type:G Protein-Coupled Receptor (GPCR)
Mol. Mass.:46968.43
Organism:Homo sapiens (Human)
Description:P50406
Residue:440
BDBM50007407
NameBDBM50007407
Synonyms:1-NP 4-Naphthalen-1-yl-piperazin-1-ium | CHEMBL277120
TypeSmall organic molecule
Emp. Form.C14H16N2
Mol. Mass.212.2902
SMILESC1CN(CCN1)c1cccc2ccccc12