Reaction Details
TargetcGMP-inhibited 3',5'-cyclic phosphodiesterase 3A/3B
LigandBDBM50146552
Substrate/Competitorn/a
Meas. Tech.ChEMBL_305271 (CHEMBL876992)
IC50 2970±n/a nM
Citation Kempson, JPitts, WJBarbosa, JGuo, JOmotoso, OWatson, AStebbins, KStarling, GCDodd, JHBarrish, JCFelix, RFischer, K Fused pyrimidine based inhibitors of phosphodiesterase 7 (PDE7): synthesis and initial structure-activity relationships. Bioorg Med Chem Lett15:1829-33 (2005) 
 
cGMP-inhibited 3',5'-cyclic phosphodiesterase 3A/3B
Name:cGMP-inhibited 3',5'-cyclic phosphodiesterase 3A/3B
Type:n/a
Mol. Mass.:n/a
Description:ASSAY_ID of ChEMBL is 156458
Components:This complex has 2 components.
Component 1
Name:cGMP-inhibited 3',5'-cyclic phosphodiesterase 3B
Synonyms:CGI-PDE B CGIPDE1 PDE3B Phosphodiesterase 3B Phosphodiesterase Type 3 (PDE3B) cGMP-inhibited 3,5-cyclic phosphodiesterase B
Type:Enzyme
Mol. Mass.:124318.95
Organism:Homo sapiens (Human)
Description:PDE3B was generated from the full-length recombinant human clone transfected into Sf9 cells.
Residue:1112
Component 2
Name:cGMP-inhibited 3',5'-cyclic phosphodiesterase 3A
Synonyms:3',5'-cyclic phosphodiesterase Cyclic GMP-inhibited phosphodiesterase A PDE3A_HUMAN Phosphodiesterase 3 (PDE3) Phosphodiesterase 3A Phosphodiesterase 3A (PDE3A1) cGMP-inhibited 3',5'-cyclic phosphodiesterase A | cGMP-inhibited 3,5-cyclic phosphodiesterase A
Type:Enzyme
Mol. Mass.:124966.46
Organism:Homo sapiens (Human)
Description:Q14432
Residue:1141
BDBM50146552
NameBDBM50146552
Synonyms:2-[7-Ethyl-6-(4-sulfamoyl-benzylamino)-7H-purin-2-ylamino]-4-methyl-thiazole-5-carboxylic acid ethyl ester ethyl 2-(7-ethyl-6-(4-sulfamoylbenzylamino)-7H-purin-2-ylamino)-4-methylthiazole-5-carboxylate
TypeSmall organic molecule
Emp. Form.C21H24N8O4S2
Mol. Mass.516.596
SMILESCCOC(=O)c1sc(Nc2nc(NCc3ccc(cc3)S(N)(=O)=O)c3n(CC)cnc3n2)nc1C