Reaction Details
TargetNeuronal acetylcholine receptor subunit alpha-7
LigandBDBM50164913
Substrate/Competitorn/a
Meas. Tech.ChEMBL_303552 (CHEMBL828952)
Ki 7±n/a nM
Citation Mazurov, AKlucik, JMiao, LPhillips, TYSeamans, ASchmitt, JDHauser, TAJohnson, RTMiller, C 2-(Arylmethyl)-3-substituted quinuclidines as selective alpha 7 nicotinic receptor ligands. Bioorg Med Chem Lett15:2073-7 (2005) 
 
Neuronal acetylcholine receptor subunit alpha-7
Name:Neuronal acetylcholine receptor subunit alpha-7
Type:Enzyme
Mol. Mass.:56502.44
Organism:Rattus norvegicus (Rat)
Description:Q05941
Residue:502
BDBM50164913
NameBDBM50164913
Synonyms:4-Bromo-N-((2R,3R)-2-pyridin-3-ylmethyl-1-aza-bicyclo[2.2.2]oct-3-yl)-benzamide | CHEMBL370523
TypeSmall organic molecule
Emp. Form.C20H22BrN3O
Mol. Mass.400.312
SMILESBrc1ccc(cc1)C(=O)N[C@@H]1C2CCN(CC2)[C@@H]1Cc1cccnc1