Reaction Details
TargetNeuronal acetylcholine receptor subunit alpha-7
LigandBDBM50164931
Substrate/Competitorn/a
Meas. Tech.ChEMBL_303552 (CHEMBL828952)
Ki 40±n/a nM
Citation Mazurov, AKlucik, JMiao, LPhillips, TYSeamans, ASchmitt, JDHauser, TAJohnson, RTMiller, C 2-(Arylmethyl)-3-substituted quinuclidines as selective alpha 7 nicotinic receptor ligands. Bioorg Med Chem Lett15:2073-7 (2005) 
 
Neuronal acetylcholine receptor subunit alpha-7
Name:Neuronal acetylcholine receptor subunit alpha-7
Type:Enzyme
Mol. Mass.:56502.44
Organism:Rattus norvegicus (Rat)
Description:Q05941
Residue:502
BDBM50164931
NameBDBM50164931
Synonyms:(4-Bromo-phenyl)-carbamic acid (2R,3R)-2-pyrimidin-5-ylmethyl-1-aza-bicyclo[2.2.2]oct-3-yl ester | CHEMBL193419
TypeSmall organic molecule
Emp. Form.C19H21BrN4O2
Mol. Mass.417.3
SMILESBrc1ccc(NC(=O)O[C@@H]2C3CCN(CC3)[C@@H]2Cc2cncnc2)cc1