Reaction Details
TargetNeuronal acetylcholine receptor subunit alpha-7
LigandBDBM50164959
Substrate/Competitorn/a
Meas. Tech.ChEMBL_303552 (CHEMBL828952)
Ki 40±n/a nM
Citation Mazurov, AKlucik, JMiao, LPhillips, TYSeamans, ASchmitt, JDHauser, TAJohnson, RTMiller, C 2-(Arylmethyl)-3-substituted quinuclidines as selective alpha 7 nicotinic receptor ligands. Bioorg Med Chem Lett15:2073-7 (2005) 
 
Neuronal acetylcholine receptor subunit alpha-7
Name:Neuronal acetylcholine receptor subunit alpha-7
Type:Enzyme
Mol. Mass.:56502.44
Organism:Rattus norvegicus (Rat)
Description:Q05941
Residue:502
BDBM50164959
NameBDBM50164959
Synonyms:(4-Bromo-phenyl)-carbamic acid 1-aza-bicyclo[2.2.2]oct-3-yl ester US8541447, 4
TypeSmall organic molecule
Emp. Form.C14H17BrN2O2
Mol. Mass.325.201
SMILESBrc1ccc(NC(=O)OC2CN3CCC2CC3)cc1