Reaction Details
TargetKappa-type opioid receptor
LigandBDBM50165049
Substrate/Competitorn/a
Meas. Tech.ChEMBL_303170 (CHEMBL829981)
Ki 0.230000±n/a nM
Citation Wentland, MPLu, QLou, RBu, YKnapp, BIBidlack, JM Synthesis and opioid receptor binding properties of a highly potent 4-hydroxy analogue of naltrexone. Bioorg Med Chem Lett15:2107-10 (2005) 
 
Kappa-type opioid receptor
Name:Kappa-type opioid receptor
Type:G Protein-Coupled Receptor (GPCR)
Mol. Mass.:42648.76
Organism:Homo sapiens (Human)
Description:P41145
Residue:380
BDBM50165049
NameBDBM50165049
Synonyms:17-cyclopropylmethyl-3,10-dihydroxy-13-oxo-(1R,9R,10S)-17-azatetracyclo[7.5.3.01,10.02,7]heptadeca-2(7),3,5-triene-4-carboxamide | CHEMBL426084
TypeSmall organic molecule
Emp. Form.C21H26N2O4
Mol. Mass.370.4421
SMILESNC(=O)c1ccc2C[C@H]3N(CC4CC4)CC[C@@]4(CC(=O)CC[C@@]34O)c2c1O