Reaction Details
TargetEukaryotic translation initiation factor 4E
LigandBDBM50165135
Substrate/Competitorn/a
Meas. Tech.ChEMBL_305877 (CHEMBL831921)
IC50 400000±n/a nM
Citation Ghosh, PPark, CPeterson, MSBitterman, PBPolunovsky, VAWagner, CR Synthesis and evaluation of potential inhibitors of eIF4E cap binding to 7-methyl GTP. Bioorg Med Chem Lett15:2177-80 (2005) 
 
Eukaryotic translation initiation factor 4E
Name:Eukaryotic translation initiation factor 4E
Type:Protein
Mol. Mass.:25095.44
Organism:Homo sapiens (Human)
Description:P06730
Residue:217
BDBM50165135
NameBDBM50165135
Synonyms:CHEMBL193790 | disodium 2-amino-9-[(2R,4S,5R)-5-[({[(1-carboxylato-2-oxo-2-phenylethyl)amino]phosphinato}oxy)methyl]-3,4-bis(propan-2-yloxy)oxolan-2-yl]-6-hydroxy-9H-purin-7-ium
TypeSmall organic molecule
Emp. Form.C25H32N6O10P
Mol. Mass.607.5301
SMILESCC(C)O[C@H]1[C@@H](COP([O-])(=O)NC(C([O-])=O)C(=O)c2ccccc2)O[C@H](C1OC(C)C)n1c[nH+]c2c1nc(N)[nH]c2=O