Reaction Details
TargetEukaryotic translation initiation factor 4E
LigandBDBM50370488
Substrate/Competitorn/a
Meas. Tech.ChEMBL_305877 (CHEMBL831921)
IC50 5000±n/a nM
Citation Ghosh, PPark, CPeterson, MSBitterman, PBPolunovsky, VAWagner, CR Synthesis and evaluation of potential inhibitors of eIF4E cap binding to 7-methyl GTP. Bioorg Med Chem Lett15:2177-80 (2005) 
 
Eukaryotic translation initiation factor 4E
Name:Eukaryotic translation initiation factor 4E
Type:Protein
Mol. Mass.:25095.44
Organism:Homo sapiens (Human)
Description:P06730
Residue:217
BDBM50370488
NameBDBM50370488
Synonyms:CHEMBL607618
TypeSmall organic molecule
Emp. Form.C11H15N5O14P3
Mol. Mass.534.1848
SMILESC[n+]1cn(C2O[C@H](COP([O-])(=O)OP([O-])(=O)OP([O-])([O-])=O)[C@@H](O)[C@H]2O)c2nc(N)[nH]c(=O)c12