Reaction Details
TargetEukaryotic translation initiation factor 4E
LigandBDBM50410172
Substrate/Competitorn/a
Meas. Tech.ChEMBL_305877 (CHEMBL831921)
IC50 55000±n/a nM
Citation Ghosh, PPark, CPeterson, MSBitterman, PBPolunovsky, VAWagner, CR Synthesis and evaluation of potential inhibitors of eIF4E cap binding to 7-methyl GTP. Bioorg Med Chem Lett15:2177-80 (2005) 
 
Eukaryotic translation initiation factor 4E
Name:Eukaryotic translation initiation factor 4E
Type:Protein
Mol. Mass.:25095.44
Organism:Homo sapiens (Human)
Description:P06730
Residue:217
BDBM50410172
NameBDBM50410172
Synonyms:CHEMBL2079724
TypeSmall organic molecule
Emp. Form.C17H27N5O7P
Mol. Mass.444.3999
SMILESCC(C)OC1C(COP([O-])=O)OC(C1OC(C)C)n1c[n+](C)c2c1nc(N)[n-]c2=O