Reaction Details
TargetProtein kinase C beta type
LigandBDBM50150697
Substrate/Competitorn/a
Meas. Tech.ChEMBL_304975 (CHEMBL829308)
IC50 370±n/a nM
Citation Engler, TAHenry, JRMalhotra, SCunningham, BFurness, KBrozinick, JBurkholder, TPClay, MPClayton, JDiefenbacher, CHawkins, EIversen, PWLi, YLindstrom, TDMarquart, ALMcLean, JMendel, DMisener, EBriere, DO'Toole, JCPorter, WJQueener, SReel, JKOwens, RABrier, RAEessalu, TEWagner, JRCampbell, RMVaughn, R Substituted 3-imidazo[1,2-a]pyridin-3-yl- 4-(1,2,3,4-tetrahydro-[1,4]diazepino-[6,7,1-hi]indol-7-yl)pyrrole-2,5-diones as highly selective and potent inhibitors of glycogen synthase kinase-3. J Med Chem47:3934-7 (2004) 
 
Protein kinase C beta type
Name:Protein kinase C beta type
Type:Enzyme
Mol. Mass.:76873.67
Organism:Homo sapiens (Human)
Description:The recombinant human PKC enzymes were produced using a baculovirus expression system in SF9 cells
Residue:671
BDBM50150697
NameBDBM50150697
Synonyms:3-Imidazo[1,2-a]pyridin-3-yl-4-[9-methyl-2-(piperidine-1-carbonyl)-1,2,3,4-tetrahydro-[1,4]diazepino[6,7,1-hi]indol-7-yl]-pyrrole-2,5-dione | CHEMBL186290
TypeSmall organic molecule
Emp. Form.C29H28N6O3
Mol. Mass.508.571
SMILESCc1cc2CN(CCn3cc(C4=C(C(=O)NC4=O)c4cnc5ccccn45)c(c1)c23)C(=O)N1CCCCC1