Reaction Details
TargetcAMP-dependent protein kinase catalytic subunit beta
LigandBDBM50150700
Substrate/Competitorn/a
Meas. Tech.ChEMBL_304949 (CHEMBL826977)
IC50>20000±n/a nM
Citation Engler, TAHenry, JRMalhotra, SCunningham, BFurness, KBrozinick, JBurkholder, TPClay, MPClayton, JDiefenbacher, CHawkins, EIversen, PWLi, YLindstrom, TDMarquart, ALMcLean, JMendel, DMisener, EBriere, DO'Toole, JCPorter, WJQueener, SReel, JKOwens, RABrier, RAEessalu, TEWagner, JRCampbell, RMVaughn, R Substituted 3-imidazo[1,2-a]pyridin-3-yl- 4-(1,2,3,4-tetrahydro-[1,4]diazepino-[6,7,1-hi]indol-7-yl)pyrrole-2,5-diones as highly selective and potent inhibitors of glycogen synthase kinase-3. J Med Chem47:3934-7 (2004) 
 
cAMP-dependent protein kinase catalytic subunit beta
Name:cAMP-dependent protein kinase catalytic subunit beta
Type:PROTEIN
Mol. Mass.:40631.25
Organism:Homo sapiens (Human)
Description:ChEMBL_586348
Residue:351
BDBM50150700
NameBDBM50150700
Synonyms:7-(4-Imidazo[1,2-a]pyridin-3-yl-2,5-dioxo-2,5-dihydro-1H-pyrrol-3-yl)-3,4-dihydro-1H-[1,4]diazepino[6,7,1-hi]indole-2-carboxylic acid isopropyl ester | CHEMBL363058
TypeSmall organic molecule
Emp. Form.C26H23N5O4
Mol. Mass.469.4919
SMILESCC(C)OC(=O)N1CCn2cc(C3=C(C(=O)NC3=O)c3cnc4ccccn34)c3cccc(C1)c23