Reaction Details
TargetProtein kinase C beta type
LigandBDBM50150702
Substrate/Competitorn/a
Meas. Tech.ChEMBL_304975 (CHEMBL829308)
IC50 560±n/a nM
Citation Engler, TAHenry, JRMalhotra, SCunningham, BFurness, KBrozinick, JBurkholder, TPClay, MPClayton, JDiefenbacher, CHawkins, EIversen, PWLi, YLindstrom, TDMarquart, ALMcLean, JMendel, DMisener, EBriere, DO'Toole, JCPorter, WJQueener, SReel, JKOwens, RABrier, RAEessalu, TEWagner, JRCampbell, RMVaughn, R Substituted 3-imidazo[1,2-a]pyridin-3-yl- 4-(1,2,3,4-tetrahydro-[1,4]diazepino-[6,7,1-hi]indol-7-yl)pyrrole-2,5-diones as highly selective and potent inhibitors of glycogen synthase kinase-3. J Med Chem47:3934-7 (2004) 
 
Protein kinase C beta type
Name:Protein kinase C beta type
Type:Enzyme
Mol. Mass.:76873.67
Organism:Homo sapiens (Human)
Description:The recombinant human PKC enzymes were produced using a baculovirus expression system in SF9 cells
Residue:671
BDBM50150702
NameBDBM50150702
Synonyms:3-Imidazo[1,2-a]pyridin-3-yl-4-[2-(piperidine-1-carbonyl)-1,2,3,4-tetrahydro-[1,4]diazepino[6,7,1-hi]indol-7-yl]-pyrrole-2,5-dione | CHEMBL362588
TypeSmall organic molecule
Emp. Form.C28H26N6O3
Mol. Mass.494.5444
SMILESO=C(N1CCCCC1)N1CCn2cc(C3=C(C(=O)NC3=O)c3cnc4ccccn34)c3cccc(C1)c23