Reaction Details
TargetSteryl-sulfatase
LigandBDBM50135162
Substrate/Competitorn/a
Meas. Tech.ChEMBL_302762 (CHEMBL838826)
Ki 190±n/a nM
Citation Horvath, ANussbaumer, PWolff, BBillich, A 2-(1-adamantyl)-4-(thio)chromenone-6-carboxylic acids: potent reversible inhibitors of human steroid sulfatase. J Med Chem47:4268-76 (2004) 
 
Steryl-sulfatase
Name:Steryl-sulfatase
Type:Enzyme
Mol. Mass.:65503.66
Organism:Homo sapiens (Human)
Description:P08842
Residue:583
BDBM50135162
NameBDBM50135162
Synonyms:CHEMBL147705 | Sulfamic acid 2-adamantan-1-yl-4-oxo-4H-chromen-6-yl ester
TypeSmall organic molecule
Emp. Form.C19H21NO5S
Mol. Mass.375.439
SMILESNS(=O)(=O)Oc1ccc2oc(cc(=O)c2c1)C12CC3CC(CC(C3)C1)C2