Reaction Details
TargetP2Y purinoceptor 1
LigandBDBM50118232
Substrate/Competitorn/a
Meas. Tech.ChEMBL_310399 (CHEMBL833177)
EC50 1.000000±n/a nM
Citation Major, DTNahum, VWang, YReiser, GFischer, B Molecular recognition in purinergic receptors. 2. Diastereoselectivity of the h-P2Y1-receptor. J Med Chem47:4405-16 (2004) 
 
P2Y purinoceptor 1
Name:P2Y purinoceptor 1
Type:PROTEIN
Mol. Mass.:42338.46
Organism:Rattus norvegicus
Description:ChEMBL_873671
Residue:373
BDBM50118232
NameBDBM50118232
Synonyms:2-MeSATP CHEMBL336208
TypeSmall organic molecule
Emp. Form.C11H18N5O13P3S
Mol. Mass.553.273
SMILESCSc1nc(N)c2ncn([C@@H]3O[C@H](COP(O)(=O)OP(O)(=O)OP(O)(O)=O)[C@@H](O)[C@H]3O)c2n1