Reaction Details
TargetSerine/threonine-protein kinase mTOR
LigandBDBM50153090
Substrate/Competitorn/a
Meas. Tech.ChEMBL_304779 (CHEMBL829473)
IC50 1.45±n/a nM
Citation Hersperger, RBuchheit, KHCammisuli, SEnz, ALohse, OPonelle, MSchuler, WSchweitzer, AWalker, CZehender, HZenke, GZimmerlin, AGZollinger, MMazzoni, LFozard, JR A locally active antiinflammatory macrolide (MLD987) for inhalation therapy of asthma. J Med Chem47:4950-7 (2004) 
 
Serine/threonine-protein kinase mTOR
Name:Serine/threonine-protein kinase mTOR
Type:Rapamycin target protein
Mol. Mass.:288917.12
Organism:Homo sapiens (Human)
Description:P42345
Residue:2549
BDBM50153090
NameBDBM50153090
Synonyms:CHEMBL411735 | Macrolide derivative
TypeSmall organic molecule
Emp. Form.C58H88N2O13
Mol. Mass.1021.3249
SMILESCOC1C[C@H](CC(C)[C@H]2OC(=O)C3CCCCN3C(=O)C(=O)[C@]3(O)CC([C@H](C[C@H]3C)OC)[C@H](C[C@@H](C)C\C(C)=C\[C@@H](CC=C)C(=O)C[C@H](O)[C@H]2C)OC)CC[C@H]1CC(=O)Nc1ccc(CCCC(=O)OC)cc1